{"text_format":"1","workbook":"xlsx","n_sheets":12,"sheets":["0. INSTRUCTION","1. PRIMARY DATA & IMS ","2. SELF-ASSESSMENT UAP&CODE","3. LIST OF TRAININGS","4. PESTICIDE REPORT","5. Verifier ONLY- CODE RATING","6. Verifier ONLY - SUMMARY","Mandatory requirements - 4C IP","Calculations","Dropdowns","Pesticide answers","HELP!"],"not_rendered":{"charts":0,"images":9,"macros":1,"external_links":0,"defined_names":40,"comments":0,"pivot_tables":0},"unopened":[],"bounds":{"document_bytes":16777216,"sheet_cells":100000,"rows_first":2000,"rows_last":500,"rows_between":2000,"halvings":0,"cell_chars":16384,"cell_head_chars":4096},"cells_cut":0,"cells_raw":0,"read":"whole","date_system":"1900"}

{"sheet":"0. INSTRUCTION","index":0,"n_rows":38,"n_cols":8,"rows_kept":38,"cut":false,"hidden":false,"merged":[[37,1,37,12],[33,2,33,11],[30,2,30,11],[32,2,32,11],[13,7,13,11],[31,2,31,11],[15,7,15,11],[16,7,16,11],[17,7,17,11],[28,2,28,7],[27,2,27,11],[10,2,10,7],[11,2,11,11],[9,1,9,12],[1,1,7,12],[8,1,8,12]]}
[null,"2017-12-01"]
[null,"ASSESSMENT TOOL FOR 4C UNITS AND VERIFIERS VERSION 3.4\n\nCAS_Doc_21_Assessment Tool_v3.4_en"]
[]
[]
[]
[]
[]
[]
[null,"INSTRUCTION"]
[]
{"$rows_left_out":29}
{"sheet":"1. PRIMARY DATA & IMS ","index":1,"n_rows":17,"n_cols":13,"rows_kept":17,"cut":false,"hidden":false,"merged":[[8,1,8,12],[9,1,10,3],[11,3,13,3],[9,12,10,12],[11,1,16,1],[11,2,15,2],[14,12,15,12],[11,12,13,12],[9,4,9,11],[16,2,16,11],[3,5,3,6],[4,5,4,6],[1,1,1,12],[2,1,2,12],[7,1,7,12],[5,5,5,6]]}
[]
[null,"PRIMARY DATA & IMS OF THE 4C UNIT"]
[null,"                     Please provide basic information about the 4C Unit and Managing Entity."]
[null,"NAME OF 4C UNIT:",null,null,null,null,null,"TYPE OF VERIFICATION OR ANNUAL UPDATE:"]
[null,"4C UNIT NUMBER:",null,null,null,null,null,"NAME OF 4C UNIT CONTACT PERSON:"]
[null,"NAME OF MANAGING ENTITY:",null,null,null,null,null,"DATE OF COMPLETION:"]
[]
[null,"                            SELF-ASSESSMENT OF THE INTERNAL MANAGEMENT SYSTEM (IMS)"]
[null,"Please determine the performance level of your Internal Management System (IMS) on a scale from “Basic” via “Intermediate” to “Advanced”. \nPlease tick the corresponding cell in column M.\nThe table below depicts the indicators necessary to attain a certain IMS performance level. \nBasic IMS: ALL basic indicators are in place\nIntermediate IMS: ALL basic AND intermediate indicators are in place\nAdvanced: ALL basic, intermediate AND advanced indicators are in place\n"]
[null,"LEVELS",null,null,"INDICATORS OF THE DIFFERENT LEVELS ",null,null,null,null,null,null,null,"ASSESSMENT BY 4C UNIT Please select"]
{"$rows_left_out":8}
{"sheet":"2. SELF-ASSESSMENT UAP&CODE","index":2,"n_rows":407,"n_cols":10,"rows_kept":407,"cut":false,"hidden":false,"merged":[[1,2,1,9],[6,2,6,6],[6,8,6,9],[7,2,9,2],[8,3,8,6],[9,3,9,6],[26,3,26,6],[27,3,27,6],[28,2,30,2],[29,3,29,6],[30,3,30,6],[25,2,27,2],[19,2,21,2],[20,3,20,6],[21,3,21,6],[22,2,24,2],[23,3,23,6],[24,3,24,6],[10,2,12,2],[11,3,11,6],[12,3,12,6],[3,2,3,9],[4,2,4,9],[13,2,15,2],[14,3,14,6],[15,3,15,6],[8,8,9,9],[11,8,12,9],[16,2,18,2],[17,3,17,6],[18,3,18,6],[362,9,367,9],[296,9,301,9],[304,9,309,9],[276,2,287,2],[276,3,287,3],[123,4,129,4],[123,5,129,5],[40,2,40,9],[43,2,43,9],[31,2,33,2],[32,3,32,6],[33,3,33,6],[34,2,36,2],[35,3,35,6],[36,3,36,6],[37,2,37,6],[37,7,37,9],[340,9,345,9],[350,2,359,2],[350,3,359,3],[149,2,149,9],[251,2,268,2],[376,9,381,9],[290,2,301,2],[290,3,301,3],[290,4,301,4],[290,5,301,5],[326,9,331,9],[340,2,347,2],[326,2,337,2],[227,2,236,2],[227,3,236,3],[227,4,236,4],[227,5,236,5],[179,3,188,3],[179,4,188,4],[151,9,154,9],[170,7,172,7],[326,3,337,3],[326,4,337,4],[326,5,337,5],[54,2,66,2],[54,3,66,3],[54,4,66,4],[54,5,66,5],[213,2,224,2],[213,3,224,3],[213,4,224,4],[213,5,224,5],[151,3,160,3],[151,4,160,4],[96,2,106,2],[96,3,106,3],[96,4,106,4],[96,5,106,5],[151,5,160,5],[163,2,175,2],[83,3,93,3],[83,4,93,4],[83,5,93,5],[163,3,175,3],[163,4,175,4],[163,5,175,5],[132,2,142,2],[132,3,142,3],[76,7,77,7],[76,8,78,8],[179,2,188,2],[109,5,120,5],[109,2,120,2],[109,3,120,3],[109,4,120,4],[123,2,129,2],[69,2,79,2],[69,3,79,3],[69,4,79,4],[83,2,93,2],[123,3,129,3],[69,5,79,5],[132,4,142,4],[132,5,142,5],[78,7,79,7],[390,9,393,9],[350,9,355,9],[362,5,373,5],[201,5,210,5],[390,2,399,2],[390,3,399,3],[390,4,399,4],[390,5,399,5],[304,2,313,2],[304,3,313,3],[239,2,248,2],[239,3,248,3],[239,4,248,4],[239,5,248,5],[376,4,387,4],[251,3,268,3],[251,4,268,4],[251,5,268,5],[290,9,295,9],[350,4,359,4],[350,5,359,5],[362,2,373,2],[362,3,373,3],[362,4,373,4],[376,2,387,2],[376,3,387,3],[304,4,313,4],[304,5,313,5],[316,2,323,2],[376,5,387,5],[316,3,323,3],[316,4,323,4],[316,5,323,5],[340,3,347,3],[340,4,347,4],[340,5,347,5],[276,5,287,5],[191,2,198,2],[191,3,198,3],[191,4,198,4],[191,5,198,5],[201,2,210,2],[201,3,210,3],[201,4,210,4],[273,2,273,9],[272,2,272,8],[251,9,256,9],[258,7,259,7],[264,7,266,7],[276,9,287,9],[191,9,194,9],[201,9,204,9],[213,9,216,9],[227,9,232,9],[276,4,287,4],[32,8,33,9],[35,8,36,9],[14,8,15,9],[17,8,18,9],[20,8,21,9],[23,8,24,9],[26,8,27,9],[29,8,30,9],[270,4,270,8],[176,2,176,9],[179,5,188,5],[144,4,144,8],[151,2,160,2],[41,2,41,9],[114,7,116,7],[69,9,70,9],[45,2,51,2],[45,3,51,3],[45,4,51,4],[45,5,51,5],[39,2,39,9],[147,2,147,9],[80,2,80,9],[179,9,187,9]]}
[]
[null,null,"SELF-ASSESSMENT AGAINST THE 4C CODE OF CONDUCT"]
[]
[null,null,"10 UNACCEPTABLE PRACTICES"]
[null,null," Please evaluate the performance of the 4C Unit against the 10 Unacceptable Practices by ticking the respective answer. "]
[]
[null,null,"PRACTICES",null,null,null,null,"TICK \nHERE","RESULTS"]
[null,null,1,"CHILD LABOUR"]
[null,null,null,"Within my 4C Unit, worst forms of child labour are still practiced. Or:\nChildren below the age of 18 years do work which is likely to jeopardize their health, safety or morals.",null,null,null,null,{"$f":"IF(Calculations!B3=2,Calculations!$K$7,IF(Calculations!B3=1,Calculations!$K$8,IF(Calculations!B3=0,Calculations!$K$6)))","v":"OK"}]
[null,null,null,"Within my 4C Unit, the worst forms of child labour are banned and excluded. And: Children below the age of 18 years do not do work which is likely to jeopardize their health, safety or morals.\n\n"]
{"$rows_left_out":398}
{"sheet":"3. LIST OF TRAININGS","index":3,"n_rows":11,"n_cols":8,"rows_kept":11,"cut":false,"hidden":false,"merged":[[3,1,3,7],[2,1,2,7],[1,1,1,7],[4,1,4,3]]}
[]
[null,"LIST OF TRAININGS                                                                                                                 "]
[null,"              The purpose of this sheet is to collect information on trainings that 4C Unit Business Partners may have received over the past 12 months\nPlease start by answering three general opening questions, before completing the table below.         \n"]
[]
[null,"I: DID THE BUSINESS PARTNERS IN YOUR UNIT RECEIVE ANY TRAININGS OVER THE LAST 12 MONTHS?"]
[null,"II: TOTAL NUMBER OF TRAINING EVENTS:"]
[null,"III: TOTAL NUMBER OF INDIVIDUAL BUSINESS PARTNERS TRAINED:"]
[]
[]
[null,"Main topic of the training                                             Please Describe","Date of the training","Category of the training                                Select from dropdown menu","No of BPs who participated in the training","Did the Managing Entity give the training?              ","If column e = \"no\", what is the name of the organization that gave the training? ","Did the Managing Entity finance the training?              "]
{"$rows_left_out":2}
{"sheet":"4. PESTICIDE REPORT","index":4,"n_rows":184,"n_cols":12,"rows_kept":184,"cut":false,"hidden":false,"merged":[[0,0,0,11],[1,0,1,11],[3,0,4,0],[3,2,4,2],[3,3,4,5],[3,6,4,6],[3,7,4,7],[3,8,4,8],[3,9,4,9],[3,10,3,11],[3,1,4,1]]}
["4C Annual Pesticide Report "]
["In this sheet, 4C Units are required to report on the pesticide use of their 4C Business Partners to the best of their knowledge.\nThe 4C Pesticide Report is to be completed by the 4C Unit’s Managing Entity. It needs to be updated annually (after initial verification). Together with sheets 1,2,3,4 and 7 of the 4C Assessment Tool, the Business Partner Mapping and the Organizational Plan it constitutes the obligatory Annual Update.\n"]
[]
["Pesticide Name (Active Ingredient)","Legend\nRed: Red List\nYellow: Yellow List\nGrey: Unacceptables List","1. Is this active ingredient used by your Business Partners? \nYes/No","2. Pesticide Name (Commercial)",null,null,"3. What is this pesticide used to control?","4. How often is this pesticide used? ","5. Approximately how many farmers use this pesticide in the 4C Unit or farmer group?","6. How much pesticide is used?","7. Information on measures to reduce pesticide risks "]
[null,null,null,null,null,null,null,null,null,null,"7a. What measures do farmers take to reduce the risk of exposing themselves or others to pesticides?","7b. What measures do farmers take to avoid contaminating water courses, wells and soil or drifting beyond the target area?"]
["Abamectin","Abamectin"]
["Acephate","Acephate"]
["Acrolein","Acrolein"]
["Alachlor","Alachlor"]
["Aldicarb","Aldicarb"]
{"$rows_left_out":175}
{"sheet":"5. Verifier ONLY- CODE RATING","index":5,"n_rows":44,"n_cols":16,"rows_kept":44,"cut":false,"hidden":false,"merged":[[3,1,4,2],[6,1,6,2],[3,14,4,14],[2,1,2,14],[1,1,1,14],[3,3,3,12],[3,13,4,13],[5,1,5,2]]}
[]
[null,"RATING OF THE SAMPLE AGAINST THE CODE PRINCIPLES - FOR VERIFIERS ONLY"]
[null,"\nThis sheet is completed by verifiers. For each principle in all three dimensions, please evaluate the performance of the Managing Entity and its Business Partners in the sample using the drop-down menu: Use grey fields only! \nIf a principle should not be applicable to any of the assessed Business Partners or the Managing Entity, please leave corresponding cells blank\n"]
[null,null,null,"Individual rating of ME and each BP of sample",null,null,null,null,null,null,null,null,null,"BP n      \n    Add BPs by pressing the \"Insert Column\" button","Comments (Optional)"]
[null,null,null,"ME","BP 1 (Full name)","BP 2 (Full name)","BP 3 (Full name)","BP 4 (Full name)","BP 5 (Full name)","BP 6 (Full name)","BP 7 (Full name)","BP 8 (Full name)","BP 9 (Full name)"]
[null,"ID of the partner, as stated in the BPM"]
[null,"Please write \"yes\" or \"no\" if the BP was visited in the previous Verification"]
[null,null,"Average rating  per principle  filled in automatically"]
[null,"Economic dimension ",null,"Please evaluate on a scale from (1=green, 2=yellow, 3=red)  using the drop-down menu "]
[null,"1.1",{"$f":"IF(ISERROR(AVERAGE(D10:N10)),0,AVERAGE(D10:N10))","v":0},null,null,null,null,null,null,null,null,null,null,null,null,1]
{"$rows_left_out":35}
{"sheet":"6. Verifier ONLY - SUMMARY","index":6,"n_rows":47,"n_cols":15,"rows_kept":47,"cut":false,"hidden":false,"merged":[[1,1,1,13],[2,1,2,13],[3,11,3,13],[6,11,6,13],[18,11,18,13],[18,1,18,10],[6,1,6,10],[7,1,7,3],[3,1,3,3],[3,4,3,10],[8,1,8,3],[14,1,14,3],[15,1,15,3],[16,1,16,3],[17,1,17,3],[9,1,9,3],[10,1,10,3],[11,1,11,3],[12,1,12,3],[13,1,13,3]]}
[]
[null,"SUMMARY OF RESULTS - FOR VERIFIERS ONLY"]
[null," This sheet summarizes and compares the results of the 4C Unit's Self Assessment and the assessment done by the verifier(s)\n\n It covers  1.) the Internal Management System 2.) the 10 Unacceptable Practices and 3.) the 27 Code Principles\nColumn E summarizes the results of the Self-Assessment of the 4C Unit \n Column F shows the evaluation results of the verifier, partly entered during the verification visit (IMS and UAP) and partly automatically transferred from sheet 4 (code rating of the sample).                                                                                                                                            \nIf results in column E and F differ, an 'F' for 'finding' will appear in column G and column K will indicate 'yes', implying that an explanation is required in column L.\n"]
[null,"INTERNAL MANAGEMENT SYSTEM",null,null,"                                          ",null,null,null,null,null,null,"CAS V.O. ONLY"]
[null,null,null,null,"Self-Assessment of the 4C Unit","Evaluation by verifier: \nPlease select from drop down list","Adjustment of the verifier result (if applicable)","Finding?","Desription of a risk, if applicable","Explanation is required?","Explanation of the finding: In case of deviation of 4C Unit Self-Assessment & verifier evaluation","CAS V.O. \nInclude additional observation? (please select Yes/No)","Please insert V.O. Evaluation\n(if inserted this will show in tab 7 - column E- Current performance level)","Please insert additional observation:\n(if inserted this will show in tab 7 - column H - Description of risk)"]
[null,null,null,null,{"$f":"IF(Calculations!C47=1,Dropdowns!F9,IF(Calculations!C47=2,Dropdowns!F10,IF(Calculations!C47=3,Dropdowns!F11,\"-\")))","v":"-"},null,null,{"$f":"IF(E6<>F6, \"F\",\"\")","v":"F"},null,{"$f":"IF(E6<>F6, \"Yes\",\"No\")","v":"Yes"},null,"No",null,null,"Yes"]
[null,"UNACCEPTABLE PRACTICES",null,null,null,null,null,null,null,null,null,"CAS V.O. ONLY",null,null,"No"]
[null,null,null,null,"Self-Assessment of the 4C Unit \n(1 = UAP not excluded, 2=UAP  excluded)","Evaluation by verifier: \nPlease select from drop down list (1 = UAP not excluded, 2=UAP  excluded)","Adjustment of the verifier result (if applicable)","Finding?","Desription of a risk, if applicable","Explanation is required?","Explanation of the finding: In case of deviation of 4C Unit Self-Assessment & verifier evaluation","CAS V.O. \nInclude additional observations? (please select Yes/No)","Please insert V.O. Evaluation\n(if inserted this will show in tab 7 - column E- Current performance level)","Please insert additional observation:\n(if inserted this will show in tab 7 - column H - Description of risk)"]
[null,"UAP 1 - Worst forms of child labor",null,null,{"$f":"Calculations!B3","v":2},null,null,{"$f":"IF(E9<>F9, \"F\",\"\")","v":"F"},null,{"$f":"IF(E9<>F9, \"Yes\",\"No\")","v":"Yes"},null,"No"]
[null,"UAP 2 - Forced and bonded labor, trafficking of persons",null,null,{"$f":"Calculations!B4","v":2},null,null,"F",null,"Yes",null,"No"]
{"$rows_left_out":38}
{"sheet":"Mandatory requirements - 4C IP","index":7,"n_rows":56,"n_cols":8,"rows_kept":56,"cut":false,"hidden":false,"merged":[[11,2,11,3],[14,2,14,3],[20,2,20,3],[21,2,21,3],[22,2,22,3],[23,2,23,3],[24,2,24,3],[15,2,15,3],[16,2,16,3],[17,2,17,3],[18,2,18,3],[19,2,19,3],[1,2,1,7],[10,2,10,3],[2,2,2,7],[3,2,3,7],[4,2,4,7],[5,2,5,7],[7,4,7,7],[6,2,6,7]]}
[]
[null,null,"Improvement Plan for 4C Unit"]
[null,null,"Instruction for 4C Units:          \nWithin 6 weeks after issuing the license, the Improvement Plan needs to be completed and sent to Coffee Assurance Services (the template is availale at CAS website).\nMoreover, the Improvement Plan needs to be updated regularly (as part of the Annual Update, in a separate \"Improvement Plan\" file)."]
[null,null,"A. Internal Management System: In case you have not reached the \"basic\" level,  AND/OR a risk has been identified "]
[null,null,"B. Unacceptable Practices: In case an Unacceptable Practice occurs AND/OR a risk has been identified "]
[null,null,"C. Code Principles: In case of red rated principles in an Initial Verification and/or principles rated as yellow with risks identified."]
[]
[null,null,null,null,"Results from the latest verification"]
[]
[null,null,"A. Internal Management System",null,"Current performance  level \nHIDDEN!!","Current performance  level ","Description of finding","Description of risk"]
{"$rows_left_out":47}
{"sheet":"Calculations","index":8,"n_rows":49,"n_cols":15,"rows_kept":49,"cut":false,"hidden":true,"merged":[[31,10,31,15],[32,10,32,15],[34,10,34,15],[40,10,42,15],[29,10,29,15],[1,0,1,1],[1,5,1,8],[16,5,16,8],[18,10,18,15],[30,5,30,8],[26,6,27,6],[27,10,27,15]]}
[]
["Unacceptable practices",null,null,null,null,"ECONOMIC DIMENSION"]
[{"$f":"'2. SELF-ASSESSMENT UAP&CODE'!D8","v":"CHILD LABOUR"},2,null,null,null,1.1000000000000001,{"$f":"'2. SELF-ASSESSMENT UAP&CODE'!D46","v":"Profitability and long term productivity"},null,{"$f":"'2. SELF-ASSESSMENT UAP&CODE'!G47","v":2}]
[{"$f":"'2. SELF-ASSESSMENT UAP&CODE'!D11","v":"FORCED AND BONDED LABOUR, TRAFFICKING IN PERSONS"},2,null,null,null,1.2,{"$f":"'2. SELF-ASSESSMENT UAP&CODE'!D55","v":"Capacity and skill development"},null,{"$f":"'2. SELF-ASSESSMENT UAP&CODE'!G56","v":2},null,"The text  in this box is only used for the text of the unacceptable practices"]
[{"$f":"'2. SELF-ASSESSMENT UAP&CODE'!D14","v":"MEMBERSHIP OF AND REPRESENTATION BY A TRADE UNION"},2,null,null,null,1.3,{"$f":"'2. SELF-ASSESSMENT UAP&CODE'!D70","v":"Record keeping"},null,{"$f":"'2. SELF-ASSESSMENT UAP&CODE'!G71","v":2},null,"PLEASE ANSWER ALL QUESTIONS !"]
[{"$f":"'2. SELF-ASSESSMENT UAP&CODE'!D17","v":"FORCED EVICTION WITHOUT ADEQUATE COMPENSATION"},2,null,null,null,1.4,{"$f":"'2. SELF-ASSESSMENT UAP&CODE'!D84","v":"Access to services"},null,{"$f":"'2. SELF-ASSESSMENT UAP&CODE'!G85","v":2},null,"PLEASE TICK FOR ASSESSMENT"]
[{"$f":"'2. SELF-ASSESSMENT UAP&CODE'!D20","v":"ADEQUATE HOUSING FOR WORKERS"},2,null,null,null,1.5,{"$f":"'2. SELF-ASSESSMENT UAP&CODE'!D97","v":"Market information and commerce"},null,{"$f":"'2. SELF-ASSESSMENT UAP&CODE'!G98","v":2},null,"OK"]
[{"$f":"'2. SELF-ASSESSMENT UAP&CODE'!D23","v":"POTABLE WATER"},2,null,null,null,1.6,{"$f":"'2. SELF-ASSESSMENT UAP&CODE'!D110","v":"Quality"},null,{"$f":"'2. SELF-ASSESSMENT UAP&CODE'!G111","v":2},null,"UNNACEPTABLE PRACTICES"]
[{"$f":"'2. SELF-ASSESSMENT UAP&CODE'!D26","v":"NATURAL RESOURCES"},2,null,null,null,1.7,{"$f":"'2. SELF-ASSESSMENT UAP&CODE'!D124","v":"Business integrity (transparent business practices)"},null,{"$f":"'2. SELF-ASSESSMENT UAP&CODE'!G125","v":2},null,"YOU CAN CONTINUE WITH THE SELF ASSESSMENT"]
[{"$f":"'2. SELF-ASSESSMENT UAP&CODE'!D29","v":"USE OF INTERNATIONALLY BANNED PESTICIDES "},2,null,null,null,1.8,{"$f":"'2. SELF-ASSESSMENT UAP&CODE'!D133","v":"Traceability"},null,{"$f":"'2. SELF-ASSESSMENT UAP&CODE'!G134","v":2},null,"YOU CAN NOT CONTINUE WITH THE SELF ASSESSMENT"]
{"$rows_left_out":40}
{"sheet":"Dropdowns","index":9,"n_rows":28,"n_cols":11,"rows_kept":28,"cut":false,"hidden":true,"merged":[[5,1,5,3],[1,1,1,10]]}
[]
[null,"For 4C maintenance team: in the green boxes below, you will find the text of the different dropdown boxes used throughout the SA.\nChanging or translating the text here, will change the respective text throughout the SA. Changing the text and or the colors is allowed. Do NOT move the text to another position"]
[]
[]
[]
[null,"3. LIST OF TRAININGS",null,null,null,"6. Verifier ONLY - SUMMARY",null,null,null,"7.IMPROVEMENT PLAN","I20"]
[]
[null,"Yes",null,"GAPS (agricultural innovative techniques and sustainable practices)",null,"Lack of basic IMS",null,null,null,"Elimination of UAP"]
[null,"No",null,"Integrated Pest Management (IPM)",null,"Basic",null,null,null,"Elimination of risk of UAP"]
[null,null,null,"Internal Management System (IMS), business and financial management, record keeping, accounting and administrative procedures; adult literacy",null,"Intermediate"]
{"$rows_left_out":19}
{"sheet":"Pesticide answers","index":10,"n_rows":196,"n_cols":8,"rows_kept":196,"cut":false,"hidden":true,"merged":[]}
["Q1 ","Q2","Q3","Q4","Q5","Q6","Q7a","Q7b"]
["To be filled in by unit","ValidAI","ValidPest","freq","ValidAmntFarmers","ValidQtyPesticide","Reduce exposure risk","Reduce polluting water"]
[null,"Abamectin","Coffee cherry borer / broca","Just once per season","All or almost all farmers (over 90%)","Open question \nGive approximate volume per season or per application in litres or kg per hectare or per local measure of area (e.g. manzana) or per bush"]
[null,"Acephate","Stemborer caterpillar","Between 1-3 times per season","Many farmers (50-90%)"]
[null,"Acrolein","Black twig borer","More than 3 times per season","Some farmers (10-49%)"]
[null,"Alachlor","Other insects",null,"Only a few farmers (less than 10%)"]
[null,"Aldicarb","Leaf rust"]
[null,"alpha-BHC;alpha-HCH","Coffee berry disease"]
[null,"Alpha-chlorohydrin","Bacterial blight"]
[null,"Aluminum phosphide","Nematodes"]
{"$rows_left_out":187}
{"sheet":"HELP!","index":11,"n_rows":13,"n_cols":3,"rows_kept":13,"cut":false,"hidden":true,"merged":[[3,1,4,1],[1,1,1,2]]}
[]
[null,"Please see useful tips below"]
[]
[null,"How to add or translate a helping box:","http://excelribbon.tips.net/T006177_Adding_Pop-Up_Documentation_to_a_Cell.html"]
[null,null,"Please be aware, messages have a 256 character limitation"]
[null,"How to amend text in Dropdown boxes:","All Dropbox texts in this Excel, with exception of sheet 7, are amended and/or translated in the Dropdowns sheet."]
[null,"How to amend text in Dropdown boxes, page 7:","Dropdowns in page 7. Pesticice Report are amended/translated in the Pesticide answers sheet"]
[null,"How to delete entries from Dropdown boxes:","Select the cell and hit the backspace or delete button. The entry will be deleted, the dropdown functionality remains."]
[null,"How to amend text in sheet 2. Assessing UAP & Code","Texts can be amended and translated in the Calculations sheet, yellow and green boxes."]
[null,"How to reset the UAP values","Go to the calculation sheet, and set the values in B3 to B12 to zero."]
{"$rows_left_out":3}